Looks like there is a new build user in town for bullseye

3 jobs for master in 15 seconds (queued for 4 seconds)
Name Stage Failure
failed
build-debian-bullseye Build
	./configure --build=x86_64-linux-gnu --prefix=/usr --includedir=\${prefix}/include --mandir=\${prefix}/share/man --infodir=\${prefix}/share/info --sysconfdir=/etc --localstatedir=/var --disable-option-checking --disable-silent-rules --libdir=\${prefix}/lib/x86_64-linux-gnu --runstatedir=/run --disable-maintainer-mode --disable-dependency-tracking
ls: cannot access '.': Operation not permitted
configure: error: working directory cannot be determined
dh_auto_configure: error: ./configure --build=x86_64-linux-gnu --prefix=/usr --includedir=\${prefix}/include --mandir=\${prefix}/share/man --infodir=\${prefix}/share/info --sysconfdir=/etc --localstatedir=/var --disable-option-checking --disable-silent-rules --libdir=\${prefix}/lib/x86_64-linux-gnu --runstatedir=/run --disable-maintainer-mode --disable-dependency-tracking returned exit code 2
make: *** [debian/rules:15: binary] Error 2
dpkg-buildpackage: error: debian/rules binary subprocess returned exit status 2
The command '/bin/sh -c ./build.sh' returned a non-zero code: 2
Cleaning up file based variables
ERROR: Job failed: exit code 2