Added building of ubuntu packages

7 jobs for master in 1 minute and 51 seconds
Status Name Job ID Coverage
  Build
failed build-debian-buster #172180

00:01:04

failed build-debian-stretch #172179

00:01:07

failed build-ubuntu-bionic #172182

00:01:10

failed build-ubuntu-focal #172185

00:00:41

failed build-ubuntu-xenial #172181

00:00:56

failed build-ubuntu-focal #172183

00:00:48

 
  Deploy
skipped deploy-apt #172184
 
Name Stage Failure
failed
build-ubuntu-bionic Build
	from /var/lib/gems/2.5.0/gems/fpm-1.12.0/bin/fpm:4:in `<top (required)>'
from /usr/local/bin/fpm:23:in `load'
from /usr/local/bin/fpm:23:in `<main>'
Makefile:60: recipe for target 'deb' failed
make[1]: Leaving directory '/builds/rude/rude/crude'
make[1]: *** [deb] Error 1
Makefile:27: recipe for target 'deb' failed
make: *** [deb] Error 2
ERROR: Job failed: exit code 1
failed
build-ubuntu-xenial Build
	from /var/lib/gems/2.3.0/gems/fpm-1.12.0/bin/fpm:4:in `<top (required)>'
from /usr/local/bin/fpm:23:in `load'
from /usr/local/bin/fpm:23:in `<main>'
make[1]: *** [deb] Error 1
Makefile:60: recipe for target 'deb' failed
make[1]: Leaving directory '/builds/rude/rude/crude'
make: *** [deb] Error 2
Makefile:27: recipe for target 'deb' failed
ERROR: Job failed: exit code 1
failed
build-ubuntu-focal Build
 1288 | static void handle_interrupt(int signum){
| ^~~~~~~~~~~~~~~~
main.c:1051:12: warning: 'check_response' defined but not used [-Wunused-function]
1051 | static int check_response( struct timeval tw1, char *msg){
| ^~~~~~~~~~~~~~
make[1]: Leaving directory '/builds/rude/rude/crude'
make[1]: *** [Makefile:40: main.o] Error 1
make: *** [Makefile:27: deb] Error 2
ERROR: Job failed: exit code 1
failed
build-debian-stretch Build
	from /var/lib/gems/2.3.0/gems/fpm-1.12.0/bin/fpm:4:in `<top (required)>'
from /usr/local/bin/fpm:22:in `load'
from /usr/local/bin/fpm:22:in `<main>'
Makefile:60: recipe for target 'deb' failed
make[1]: Leaving directory '/builds/rude/rude/crude'
make[1]: *** [deb] Error 1
Makefile:27: recipe for target 'deb' failed
make: *** [deb] Error 2
ERROR: Job failed: exit code 1
failed
build-debian-buster Build
	from /usr/lib/ruby/2.5.0/rubygems/core_ext/kernel_require.rb:59:in `require'
from /usr/lib/ruby/2.5.0/rubygems/core_ext/kernel_require.rb:59:in `require'
from /var/lib/gems/2.5.0/gems/fpm-1.12.0/bin/fpm:4:in `<top (required)>'
from /usr/local/bin/fpm:23:in `load'
from /usr/local/bin/fpm:23:in `<main>'
make[1]: *** [Makefile:60: deb] Error 1
make[1]: Leaving directory '/builds/rude/rude/crude'
make: *** [Makefile:27: deb] Error 2
ERROR: Job failed: exit code 1